patient ,sex,age,patientstatus,co_diseasse,DM,CVD,HTN,pulmonary,renal,cancer,Hyperlipidemia,endocrine,hematology,rheumatologic,ENT,otherneurologic,onset.time,dyspnea,cough,fever,naseau,diarrhea,headache,vertigo,photophobia,balance.disturbances,speechproblem,muscle.weakness,lowered.hand.foot.force,auditory.hal,visual.hal,LOC,sequelae,anosmia,hypogeusia,vision.problem,disorientation,cbc,lft,abg,WBC1,RBC1,Hb1,Hct1,MCV1,MCH1,MCHC1,PLT1,RDW1,PDW1,MPV1,PLCR1,Mixed1,Band1,Segment1,Lymphocyte1,monocyte1,Eosinophile1,Basophile1,WBC2,RBC2,Hb2,Hct2,MCV2,MCH2,MCHC2,PLT2,RDW2,PDW2,MPV2,PLCR2,Mixed2,Band2,Segment2,Lymphocyte2,monocyte2,Eosinophile2,Basophile2,WBC3,RBC3,Hb3,Hct3,MCV3,MCH3,MCHC3,PLT3,RDW3,PDW3,MPV3,PLCR3,Mixed3,Band3,Segment3,Lymphocyte3,monocyte3,Eosinophile3,Basophile3,WBC4,RBC4,Hb4,Hct4,MCV4,MCH4,MCHC4,PLT4,RDW4,PDW4,MPV4,PLCR4,Mixed4,Band4,Segment4,Lymphocyte4,monocyte4,Eosinophile4,Basophile4,WBC5,RBC5,Hb5,Hct5,MCV5,MCH5,MCHC5,PLT5,RDW5,PDW5,MPV5,PLCR5,Mixed5,Band5,Segment5,Lymphocyte5,monocyte5,Eosinophile5,Basophile5,WBC6,RBC6,Hb6,Hct6,MCV6,MCH6,MCHC6,PLT6,RDW6,PDW6,MPV6,PLCR6,Mixed6,Band6,Segment6,Lymphocyte6,monocyte6,Eosinophile6,Basophile6,WBC7,RBC7,Hb7,Hct7,MCV7,MCH7,MCHC7,PLT7,RDW7,PDW7,MPV7,PLCR7,Mixed7,Band7,Segment7,Lymphocyte7,monocyte7,Eosinophile7,Basophile7,WBC8,RBC8,Hb8,Hct8,MCV8,MCH8,MCHC8,PLT8,RDW8,PDW8,MPV8,PLCR8,Mixed8,Band8,Segment8,Lymphocyte8,monocyte8,Eosinophile8,Basophile8,WBC9,RBC9,Hb9,Hct9,MCV9,MCH9,MCHC9,PLT9,RDW9,PDW9,MPV9,PLCR9,Mixed9,Band9,Segment9,Lymphocyte9,monocyte9,Eosinophile9,Basophile9,WBC10,RBC10,Hb10,Hct10,MCV10,MCH10,MCHC10,PLT10,RDW10,PDW10,MPV10,PLCR10,Mixed10,Band10,Segment10,Lymphocyte10,monocyte10,Eosinophile10,Basophile10,WBC11,RBC11,Hb11,Hct11,MCV11,MCH11,MCHC11,PLT11,RDW11,PDW11,MPV11,PLCR11,Mixed11,Band11,Segment11,Lymphocyte11,monocyte11,Eosinophile11,Basophile11,WBC12,RBC12,Hb12,Hct12,MCV12,MCH12,MCHC12,PLT12,RDW12,PDW12,MPV12,PLCR12,Mixed12,Band12,Segment12,Lymphocyte12,monocyte12,Eosinophile12,Basophile12,WBC13,RBC13,Hb13,Hct13,MCV13,MCH13,MCHC13,PLT13,RDW13,PDW13,MPV13,PLCR13,Mixed13,Band13,Segment13,Lymphocyte13,monocyte13,Eosinophile13,Basophile13,WBC14,RBC14,Hb14,Hct14,MCV14,MCH14,MCHC14,PLT14,RDW14,PDW14,MPV14,PLCR14,Mixed14,Band14,Segment14,Lymphocyte14,monocyte14,Eosinophile14,Basophile14,SGOT1,SGPT1,CPK1,ALKP1,SGOT2,SGPT2,CPK2,ALKP2,SGOT3,SGPT3,CPK3,ALKP3,SGOT4,SGPT4,CPK4,ALKP4,SGOT5,SGPT5,CPK5,ALKP5,SGOT6,SGPT6,CPK6,ALKP6,SGOT7,SGPT7,CPK7,ALKP7,SGOT8,SGPT8,CPK8,ALKP8,SGOT9,SGPT9,CPK9,ALKP9,SGOT10,SGPT10,CPK10,ALKP10,SGOT11,SGPT11,CPK11,ALKP11,SGOT12,SGPT12,CPK12,ALKP12,PH.1,PCO2.1,PO2.1,HCO3.1,O2Sat.1,BE.1,BB.1,Beecf.1,PH.2,PCO2.2,PO2.2,HCO3.2,O2Sat.2,BE.2,BB.2,Beecf.2,PH.3,PCO2.3,PO2.3,HCO3.3,O2Sat.3,BE.3,BB.3,Beecf.3,PH.4,PCO2.4,PO2.4,HCO3.4,O2Sat.4,BE.4,BB.4,Beecf.4,PH.5,PCO2.5,PO2.5,HCO3.5,O2Sat.5,BE.5,BB.5,Beecf.5,PH.6,PCO2.6,PO2.6,HCO3.6,O2Sat.6,BE.6,BB.6,Beecf.6,PH.7,PCO2.7,PO2.7,HCO3.7,O2Sat.7,BE.7,BB.7,Beecf.7,PH.8,PCO2.8,PO2.8,HCO3.8,O2Sat.8,BE.8,BB.8,Beecf.8,PH.9,PCO2.9,PO2.9,HCO3.9,O2Sat.9,BE.9,BB.9,Beecf.9,PH.10,PCO2.10,PO2.10,HCO3.10,O2Sat.10,BE.10,BB.10,Beecf.10,PH.11,PCO2.11,PO2.11,HCO3.11,O2Sat.11,BE.11,BB.11,Beecf.11,PH.12,PCO2.12,PO2.12,HCO3.12,O2Sat.12,BE.12,BB.12,Beecf.12,PH.13,PCO2.13,PO2.13,HCO3.13,O2Sat.13,BE.13,BB.13,Beecf.13,PH.14,PCO2.14,PO2.14,HCO3.14,O2Sat.14,BE.14,BB.14,Beecf.14,PH.15,PCO2.15,PO2.15,HCO3.15,O2Sat.15,BE.15,BB.15,Beecf.15,PH.16,PCO2.16,PO2.16,HCO3.16,O2Sat.16,BE.16,BB.16,Beecf.16,PH.17,PCO2.17,PO2.17,HCO3.17,O2Sat.17,BE.17,BB.17,Beecf.17,PH.18,PCO2.18,PO2.18,HCO3.18,O2Sat.18,BE.18,BB.18,Beecf.18,PH.19,PCO2.19,PO2.19,HCO3.19,O2Sat.19,BE.19,BB.19,Beecf.19,PH.20,PCO2.20,PO2.20,HCO3.20,O2Sat.20,BE.20,BB.20,Beecf.20,PH.21,PCO2.21,PO2.21,HCO3.21,O2Sat.21,BE.21,BB.21,Beecf.21,PH.22,PCO2.22,PO2.22,HCO3.22,O2Sat.22,BE.22,BB.22,Beecf.22,PH.23,PCO2.23,PO2.23,HCO3.23,O2Sat.23,BE.23,BB.23,Beecf.23,PH.24,PCO2.24,PO2.24,HCO3.24,O2Sat.24,BE.24,BB.24,Beecf.24,PH.25,PCO2.25,PO2.25,HCO3.25,O2Sat.25,BE.25,BB.25,Beecf.25,PH.26,PCO2.26,PO2.26,HCO3.26,O2Sat.26,BE.26,BB.26,Beecf.26,PH.27,PCO2.27,PO2.27,HCO3.27,O2Sat.27,BE.27,BB.27,Beecf.27,PH.28,PCO2.28,PO2.28,HCO3.28,O2Sat.28,BE.28,BB.28,Beecf.28,PH.29,PCO2.29,PO2.29,HCO3.29,O2Sat.29,BE.29,BB.29,Beecf.29,PH.30,PCO2.30,PO2.30,HCO3.30,O2Sat.30,BE.30,BB.30,Beecf.30,PH.31,PCO2.31,PO2.31,HCO3.31,O2Sat.31,BE.31,BB.31,Beecf.31,PH.32,PCO2.32,PO2.32,HCO3.32,O2Sat.32,BE032,BB.32,Beecf.32,PH.33,PCO2.33,PO2.33,HCO3.33,O2Sat.33,BE.33,BB.33,Beecf.33,PH.34,PCO2.34,PO2.34,HCO3.34,O2Sat.34,BE.34,BB.34,Beecf.34,PH.35,PCO2.35,PO2.35,HCO3.35,O2Sat.35,BE.35,BB.35,Beecf.35,PH.36,PCO2.36,PO2.36,HCO3.36,O2Sat.36,BE.36,BB.36,Beecf.36,PH.37,PCO2.37,PO2.37,HCO3.37,O2Sat.37,BE.37,BB.37,Beecf.37,PH.38,PCO2.38,PO2.38,HCO3.38,O2Sat.38,BE.38,BB.38,Beecf.38,PH.39,PCO2.39,PO2.39,HCO3.39,O2Sat.39,BE.39,BB.39,Beecf.39,PH.40,PCO2.40,PO2.40,HCO3.40,O2Sat.40,BE.40,BB.40,Beecf.40,PH.41,PCO2.41,PO2.41,HCO3.41,O2Sat.41,BE.41,BB.41,Beecf.41,PH.42,PCO2.42,PO2.42,HCO3.42,O2Sat.42,BE.42,BB.42,Beecf.42,PH.43,PCO2.43,PO2.43,HCO3.43,O2Sat.43,BE.43,BB.43,Beecf.43,PH.44,PCO2.44,PO2.44,HCO3.44,O2Sat.44,BE.44,BB.44,Beecf.44,PH,PCO2.45,PO2.45,HCO3.45,O2Sat.45,BE.45,BB.45,Beecf.45,PH.46,PCO2.46,PO2.46,HCO3.46,O2Sat.46,BE.46,BB.46,Beecf.46,PH.47,PCO2.47,PO2.47,HCO3.47,O2Sat.47,BE.47,BB.47,Beecf.47,PH.48,PCO2.48,PO2.48,HCO3.48,O2Sat.48,BE.48,BB.48,Beecf.48,PH.49,PCO2.49,PO2.49,HCO3.49,O2Sat.49,BE.49,BB.49,Beecf.49,PH.50,PCO2.50,PO2.50,HCO3.50,O2Sat.50,BE.50,BB.50,Beecf.50,PH.51,PCO2.51,PO2.51,HCO3.51,O2Sat.51,BE.51,BB.51,Beecf.51,PH.52,PCO2.52,PO2.52,HCO3.52,O2Sat.52,BE.52,BB.52,Beecf.52,PH.53,PCO2.53,PO2.53,HCO3.53,O2Sat.53,BE.53,BB.53,Beecf.53,PH.54,PCO2.54,PO2.54,HCO3.54,O2Sat.54,BE.54,BB.54,Beecf.54,PH.55,PCO2.55,PO2.55,HCO3.55,O2Sat.55,BE.55,BB.55,Beecf.55
p1,male,84,inpatient,no,no,no,no,no,no,no,no,no,no,no,no,no,2.0,yes,yes,yes,no,no,no,yes,no,yes,no,yes,yes,no,no,no,no,no,no,no,yes,1.0,,,13.2,4.72,14.2,41.4,87.7,30.1,34.3,140.0,13.7,13.9,11.2,33.6,,,,,,,,,,,,,,,,,,,,,,,,,,,,,,,,,,,,,,,,,,,,,,,,,,,,,,,,,,,,,,,,,,,,,,,,,,,,,,,,,,,,,,,,,,,,,,,,,,,,,,,,,,,,,,,,,,,,,,,,,,,,,,,,,,,,,,,,,,,,,,,,,,,,,,,,,,,,,,,,,,,,,,,,,,,,,,,,,,,,,,,,,,,,,,,,,,,,,,,,,,,,,,,,,,,,,,,,,,,,,,,,,,,,,,,,,,,,,,,,,,,,,,,,,,,,,,,,,,,,,,,,,,,,,,,,,,,,,,,,,,,,,,,,,,,,,,,,,,,,,,,,,,,,,,,,,,,,,,,,,,,,,,,,,,,,,,,,,,,,,,,,,,,,,,,,,,,,,,,,,,,,,,,,,,,,,,,,,,,,,,,,,,,,,,,,,,,,,,,,,,,,,,,,,,,,,,,,,,,,,,,,,,,,,,,,,,,,,,,,,,,,,,,,,,,,,,,,,,,,,,,,,,,,,,,,,,,,,,,,,,,,,,,,,,,,,,,,,,,,,,,,,,,,,,,,,,,,,,,,,,,,,,,,,,,,,,,,,,,,,,,,,,,,,,,,,,,,,,,,,,,,,,,,,,,,,,,,,,,,,,,,,,,,,,,,,,,,,,,,,,,,,,,,,,,,,,,,,,,,,,,,,,,,,,,,,,,,,,,,,,,,,,,,,,,,,,,,,,,,,,,,,,,,,,,,,,,,,,,,,,,,,,,,,,,,,,,,,,,,,,,,,,,,,,,,,,,,,,,,,,,,,,,,,,,,,,,,,,,,,,
p2,female,75,inpatient,yes,no,yes,yes,yes,no,no,no,no,no,no,no,no,28.0,yes,no,no,yes,yes,no,no,no,no,no,no,no,no,no,no,no,no,no,no,no,6.0,2.0,,9.9,4.16,12.7,36.2,87.0,30.5,35.1,135.0,13.5,13.6,10.2,27.4,,,,,,,,6.6,4.06,12.1,34.8,85.7,29.8,34.8,182.0,13.9,12.6,9.7,23.6,,3.0,69.0,19.0,8.0,1.0,,5.5,4.17,12.3,35.6,85.4,29.5,34.6,241.0,13.9,11.8,9.3,20.7,,,,,,,,6.2,4.2,12.2,35.9,85.5,29.0,34.0,263.0,14.3,11.7,9.4,21.3,,,,,,,,8.9,3.79,11.1,32.9,86.8,29.3,33.7,254.0,14.7,10.9,9.1,19.2,,,,,,,,8.1,4.09,12.1,36.2,88.5,29.6,33.4,291.0,15.4,11.0,9.0,18.1,,,,,,,,,,,,,,,,,,,,,,,,,,,,,,,,,,,,,,,,,,,,,,,,,,,,,,,,,,,,,,,,,,,,,,,,,,,,,,,,,,,,,,,,,,,,,,,,,,,,,,,,,,,,,,,,,,,,,,,,,,,,,,,,,,,,,,,,,,,,,,,,,,,,,,,,,,,,,,,,96.0,28.0,,116.0,108.0,34.0,2437.0,122.0,,,,,,,,,,,,,,,,,,,,,,,,,,,,,,,,,,,,,,,,,,,,,,,,,,,,,,,,,,,,,,,,,,,,,,,,,,,,,,,,,,,,,,,,,,,,,,,,,,,,,,,,,,,,,,,,,,,,,,,,,,,,,,,,,,,,,,,,,,,,,,,,,,,,,,,,,,,,,,,,,,,,,,,,,,,,,,,,,,,,,,,,,,,,,,,,,,,,,,,,,,,,,,,,,,,,,,,,,,,,,,,,,,,,,,,,,,,,,,,,,,,,,,,,,,,,,,,,,,,,,,,,,,,,,,,,,,,,,,,,,,,,,,,,,,,,,,,,,,,,,,,,,,,,,,,,,,,,,,,,,,,,,,,,,,,,,,,,,,,,,,,,,,,,,,,,,,,,,,,,,,,,,,,,,,,,,,,,,,,,,,,,,,,,,,,,,,,,,,,,,,,,,,,,,,,,,,,,,,,,,,,,,,,,,,,,,,,,,,,,,,,,,,,,,,,,,,,,,,,,,,,,,,,,,,,,,,,,,,,,
p3,male,48,inpatient,yes,no,no,no,yes,no,no,no,no,no,no,no,no,30.0,yes,yes,yes,yes,yes,yes,yes,yes,yes,no,yes,yes,yes,no,yes,no,no,no,no,yes,,,,,,,,,,,,,,,,,,,,,,,,,,,,,,,,,,,,,,,,,,,,,,,,,,,,,,,,,,,,,,,,,,,,,,,,,,,,,,,,,,,,,,,,,,,,,,,,,,,,,,,,,,,,,,,,,,,,,,,,,,,,,,,,,,,,,,,,,,,,,,,,,,,,,,,,,,,,,,,,,,,,,,,,,,,,,,,,,,,,,,,,,,,,,,,,,,,,,,,,,,,,,,,,,,,,,,,,,,,,,,,,,,,,,,,,,,,,,,,,,,,,,,,,,,,,,,,,,,,,,,,,,,,,,,,,,,,,,,,,,,,,,,,,,,,,,,,,,,,,,,,,,,,,,,,,,,,,,,,,,,,,,,,,,,,,,,,,,,,,,,,,,,,,,,,,,,,,,,,,,,,,,,,,,,,,,,,,,,,,,,,,,,,,,,,,,,,,,,,,,,,,,,,,,,,,,,,,,,,,,,,,,,,,,,,,,,,,,,,,,,,,,,,,,,,,,,,,,,,,,,,,,,,,,,,,,,,,,,,,,,,,,,,,,,,,,,,,,,,,,,,,,,,,,,,,,,,,,,,,,,,,,,,,,,,,,,,,,,,,,,,,,,,,,,,,,,,,,,,,,,,,,,,,,,,,,,,,,,,,,,,,,,,,,,,,,,,,,,,,,,,,,,,,,,,,,,,,,,,,,,,,,,,,,,,,,,,,,,,,,,,,,,,,,,,,,,,,,,,,,,,,,,,,,,,,,,,,,,,,,,,,,,,,,,,,,,,,,,,,,,,,,,,,,,,,,,,,,,,,,,,,,,,,,,,,,,,,,,,,,,,,,,,,,,,,,,,,,
p4,female,34,inpatient,no,no,no,no,no,no,no,no,no,no,no,no,no,30.0,yes,yes,yes,no,no,yes,no,no,no,yes,yes,no,no,no,no,no,no,no,no,no,3.0,2.0,2.0,3.4,4.9,11.3,36.3,74.1,23.1,31.1,124.0,15.2,,,,,,,,,,,4.2,4.57,10.1,33.2,72.6,22.1,30.4,291.0,,,,,,,,,,,,4.8,4.57,10.4,33.4,73.1,22.8,31.1,301.0,15.7,11.5,8.5,17.3,,,,,,,,,,,,,,,,,,,,,,,,,,,,,,,,,,,,,,,,,,,,,,,,,,,,,,,,,,,,,,,,,,,,,,,,,,,,,,,,,,,,,,,,,,,,,,,,,,,,,,,,,,,,,,,,,,,,,,,,,,,,,,,,,,,,,,,,,,,,,,,,,,,,,,,,,,,,,,,,,,,,,,,,,,,,,,,,,,,,,,,,,,,,,,,,,,,,,,,,,,,,,,,,,,,,,,,,,65.0,77.0,,,72.0,93.0,,113.0,,,,,,,,,,,,,,,,,,,,,,,,,,,,,,,,,,,,,,,,,7.4,50.1,28.7,31.0,54.0,5.9,52.3,6.4,7.43,29.7,55.6,19.7,8.8,-3.0,42.7,-3.4,,,,,,,,,,,,,,,,,,,,,,,,,,,,,,,,,,,,,,,,,,,,,,,,,,,,,,,,,,,,,,,,,,,,,,,,,,,,,,,,,,,,,,,,,,,,,,,,,,,,,,,,,,,,,,,,,,,,,,,,,,,,,,,,,,,,,,,,,,,,,,,,,,,,,,,,,,,,,,,,,,,,,,,,,,,,,,,,,,,,,,,,,,,,,,,,,,,,,,,,,,,,,,,,,,,,,,,,,,,,,,,,,,,,,,,,,,,,,,,,,,,,,,,,,,,,,,,,,,,,,,,,,,,,,,,,,,,,,,,,,,,,,,,,,,,,,,,,,,,,,,,,,,,,,,,,,,,,,,,,,,,,,,,,,,,,,,,,,,,,,,,,,,,,,,,,,,,,,,,,,,,,,,,,,,,,,,,,,,,,,,,,,,,,,,,,,,,,,,,,,,,,,,,,,,,,,,,,,,,,,,,,
p5,female,31,inpatient,no,no,no,no,no,no,no,no,no,no,no,no,no,,no,no,no,no,no,no,no,no,no,no,no,no,no,no,no,no,no,no,no,no,,,,,,,,,,,,,,,,,,,,,,,,,,,,,,,,,,,,,,,,,,,,,,,,,,,,,,,,,,,,,,,,,,,,,,,,,,,,,,,,,,,,,,,,,,,,,,,,,,,,,,,,,,,,,,,,,,,,,,,,,,,,,,,,,,,,,,,,,,,,,,,,,,,,,,,,,,,,,,,,,,,,,,,,,,,,,,,,,,,,,,,,,,,,,,,,,,,,,,,,,,,,,,,,,,,,,,,,,,,,,,,,,,,,,,,,,,,,,,,,,,,,,,,,,,,,,,,,,,,,,,,,,,,,,,,,,,,,,,,,,,,,,,,,,,,,,,,,,,,,,,,,,,,,,,,,,,,,,,,,,,,,,,,,,,,,,,,,,,,,,,,,,,,,,,,,,,,,,,,,,,,,,,,,,,,,,,,,,,,,,,,,,,,,,,,,,,,,,,,,,,,,,,,,,,,,,,,,,,,,,,,,,,,,,,,,,,,,,,,,,,,,,,,,,,,,,,,,,,,,,,,,,,,,,,,,,,,,,,,,,,,,,,,,,,,,,,,,,,,,,,,,,,,,,,,,,,,,,,,,,,,,,,,,,,,,,,,,,,,,,,,,,,,,,,,,,,,,,,,,,,,,,,,,,,,,,,,,,,,,,,,,,,,,,,,,,,,,,,,,,,,,,,,,,,,,,,,,,,,,,,,,,,,,,,,,,,,,,,,,,,,,,,,,,,,,,,,,,,,,,,,,,,,,,,,,,,,,,,,,,,,,,,,,,,,,,,,,,,,,,,,,,,,,,,,,,,,,,,,,,,,,,,,,,,,,,,,,,,,,,,,,,,,,,,,,,,,,,
p6,male,34,icu,no,no,no,no,no,no,no,no,no,no,no,no,no,30.0,yes,no,yes,no,no,no,no,no,no,no,no,no,no,no,no,no,no,no,no,no,2.0,6.0,,1.7,4.71,14.8,42.7,90.7,31.4,34.7,65.0,11.7,17.5,12.6,46.1,,,,,,,,1.7,4.71,14.8,42.7,90.7,31.4,34.7,65.0,11.7,17.5,12.6,46.1,,,,,,,,,,,,,,,,,,,,,,,,,,,,,,,,,,,,,,,,,,,,,,,,,,,,,,,,,,,,,,,,,,,,,,,,,,,,,,,,,,,,,,,,,,,,,,,,,,,,,,,,,,,,,,,,,,,,,,,,,,,,,,,,,,,,,,,,,,,,,,,,,,,,,,,,,,,,,,,,,,,,,,,,,,,,,,,,,,,,,,,,,,,,,,,,,,,,,,,,,,,,,,,,,,,,,,,,,,,,,,,,,,,,,,,,,,,,246.0,236.0,,343.0,144.0,180.0,,336.0,56.0,111.0,,319.0,68.0,26.0,,139.0,87.0,40.0,,149.0,87.0,31.0,,179.0,,,,,,,,,,,,,,,,,,,,,,,,,,,,,,,,,,,,,,,,,,,,,,,,,,,,,,,,,,,,,,,,,,,,,,,,,,,,,,,,,,,,,,,,,,,,,,,,,,,,,,,,,,,,,,,,,,,,,,,,,,,,,,,,,,,,,,,,,,,,,,,,,,,,,,,,,,,,,,,,,,,,,,,,,,,,,,,,,,,,,,,,,,,,,,,,,,,,,,,,,,,,,,,,,,,,,,,,,,,,,,,,,,,,,,,,,,,,,,,,,,,,,,,,,,,,,,,,,,,,,,,,,,,,,,,,,,,,,,,,,,,,,,,,,,,,,,,,,,,,,,,,,,,,,,,,,,,,,,,,,,,,,,,,,,,,,,,,,,,,,,,,,,,,,,,,,,,,,,,,,,,,,,,,,,,,,,,,,,,,,,,,,,,,,,,,,,,,,,,,,,,,,,,,,,,,,,,,,,,,,,,,,,,,,,,,,,,,,,,,,,,,,,,,,,,,,,,,,,,,,,,,
p7,male,44,inpatient,yes,no,no,no,no,yes,no,no,no,no,no,no,no,8.0,yes,no,no,no,no,no,no,no,yes,no,no,yes,no,no,no,no,no,no,no,yes,,,,,,,,,,,,,,,,,,,,,,,,,,,,,,,,,,,,,,,,,,,,,,,,,,,,,,,,,,,,,,,,,,,,,,,,,,,,,,,,,,,,,,,,,,,,,,,,,,,,,,,,,,,,,,,,,,,,,,,,,,,,,,,,,,,,,,,,,,,,,,,,,,,,,,,,,,,,,,,,,,,,,,,,,,,,,,,,,,,,,,,,,,,,,,,,,,,,,,,,,,,,,,,,,,,,,,,,,,,,,,,,,,,,,,,,,,,,,,,,,,,,,,,,,,,,,,,,,,,,,,,,,,,,,,,,,,,,,,,,,,,,,,,,,,,,,,,,,,,,,,,,,,,,,,,,,,,,,,,,,,,,,,,,,,,,,,,,,,,,,,,,,,,,,,,,,,,,,,,,,,,,,,,,,,,,,,,,,,,,,,,,,,,,,,,,,,,,,,,,,,,,,,,,,,,,,,,,,,,,,,,,,,,,,,,,,,,,,,,,,,,,,,,,,,,,,,,,,,,,,,,,,,,,,,,,,,,,,,,,,,,,,,,,,,,,,,,,,,,,,,,,,,,,,,,,,,,,,,,,,,,,,,,,,,,,,,,,,,,,,,,,,,,,,,,,,,,,,,,,,,,,,,,,,,,,,,,,,,,,,,,,,,,,,,,,,,,,,,,,,,,,,,,,,,,,,,,,,,,,,,,,,,,,,,,,,,,,,,,,,,,,,,,,,,,,,,,,,,,,,,,,,,,,,,,,,,,,,,,,,,,,,,,,,,,,,,,,,,,,,,,,,,,,,,,,,,,,,,,,,,,,,,,,,,,,,,,,,,,,,,,,,,,,,,,,,,,,,
p8,male,50,inpatient,no,no,no,no,no,no,no,no,no,no,no,no,no,17.0,yes,no,no,no,no,yes,no,no,no,no,yes,yes,no,no,no,no,no,yes,no,no,,,,,,,,,,,,,,,,,,,,,,,,,,,,,,,,,,,,,,,,,,,,,,,,,,,,,,,,,,,,,,,,,,,,,,,,,,,,,,,,,,,,,,,,,,,,,,,,,,,,,,,,,,,,,,,,,,,,,,,,,,,,,,,,,,,,,,,,,,,,,,,,,,,,,,,,,,,,,,,,,,,,,,,,,,,,,,,,,,,,,,,,,,,,,,,,,,,,,,,,,,,,,,,,,,,,,,,,,,,,,,,,,,,,,,,,,,,,,,,,,,,,,,,,,,,,,,,,,,,,,,,,,,,,,,,,,,,,,,,,,,,,,,,,,,,,,,,,,,,,,,,,,,,,,,,,,,,,,,,,,,,,,,,,,,,,,,,,,,,,,,,,,,,,,,,,,,,,,,,,,,,,,,,,,,,,,,,,,,,,,,,,,,,,,,,,,,,,,,,,,,,,,,,,,,,,,,,,,,,,,,,,,,,,,,,,,,,,,,,,,,,,,,,,,,,,,,,,,,,,,,,,,,,,,,,,,,,,,,,,,,,,,,,,,,,,,,,,,,,,,,,,,,,,,,,,,,,,,,,,,,,,,,,,,,,,,,,,,,,,,,,,,,,,,,,,,,,,,,,,,,,,,,,,,,,,,,,,,,,,,,,,,,,,,,,,,,,,,,,,,,,,,,,,,,,,,,,,,,,,,,,,,,,,,,,,,,,,,,,,,,,,,,,,,,,,,,,,,,,,,,,,,,,,,,,,,,,,,,,,,,,,,,,,,,,,,,,,,,,,,,,,,,,,,,,,,,,,,,,,,,,,,,,,,,,,,,,,,,,,,,,,,,,,,,,,,,,,,
p9,female,52,inpatient,yes,no,no,no,no,no,yes,no,no,no,no,no,no,4.0,no,no,no,no,no,no,no,no,no,no,no,no,no,no,no,no,no,no,no,no,,,,,,,,,,,,,,,,,,,,,,,,,,,,,,,,,,,,,,,,,,,,,,,,,,,,,,,,,,,,,,,,,,,,,,,,,,,,,,,,,,,,,,,,,,,,,,,,,,,,,,,,,,,,,,,,,,,,,,,,,,,,,,,,,,,,,,,,,,,,,,,,,,,,,,,,,,,,,,,,,,,,,,,,,,,,,,,,,,,,,,,,,,,,,,,,,,,,,,,,,,,,,,,,,,,,,,,,,,,,,,,,,,,,,,,,,,,,,,,,,,,,,,,,,,,,,,,,,,,,,,,,,,,,,,,,,,,,,,,,,,,,,,,,,,,,,,,,,,,,,,,,,,,,,,,,,,,,,,,,,,,,,,,,,,,,,,,,,,,,,,,,,,,,,,,,,,,,,,,,,,,,,,,,,,,,,,,,,,,,,,,,,,,,,,,,,,,,,,,,,,,,,,,,,,,,,,,,,,,,,,,,,,,,,,,,,,,,,,,,,,,,,,,,,,,,,,,,,,,,,,,,,,,,,,,,,,,,,,,,,,,,,,,,,,,,,,,,,,,,,,,,,,,,,,,,,,,,,,,,,,,,,,,,,,,,,,,,,,,,,,,,,,,,,,,,,,,,,,,,,,,,,,,,,,,,,,,,,,,,,,,,,,,,,,,,,,,,,,,,,,,,,,,,,,,,,,,,,,,,,,,,,,,,,,,,,,,,,,,,,,,,,,,,,,,,,,,,,,,,,,,,,,,,,,,,,,,,,,,,,,,,,,,,,,,,,,,,,,,,,,,,,,,,,,,,,,,,,,,,,,,,,,,,,,,,,,,,,,,,,,,,,,,,,,,,,,,,,
p10,male,56,inpatient,no,no,no,no,no,no,no,no,no,no,no,no,no,,no,no,yes,yes,no,no,no,no,no,no,yes,yes,no,no,no,no,no,no,no,no,,,,,,,,,,,,,,,,,,,,,,,,,,,,,,,,,,,,,,,,,,,,,,,,,,,,,,,,,,,,,,,,,,,,,,,,,,,,,,,,,,,,,,,,,,,,,,,,,,,,,,,,,,,,,,,,,,,,,,,,,,,,,,,,,,,,,,,,,,,,,,,,,,,,,,,,,,,,,,,,,,,,,,,,,,,,,,,,,,,,,,,,,,,,,,,,,,,,,,,,,,,,,,,,,,,,,,,,,,,,,,,,,,,,,,,,,,,,,,,,,,,,,,,,,,,,,,,,,,,,,,,,,,,,,,,,,,,,,,,,,,,,,,,,,,,,,,,,,,,,,,,,,,,,,,,,,,,,,,,,,,,,,,,,,,,,,,,,,,,,,,,,,,,,,,,,,,,,,,,,,,,,,,,,,,,,,,,,,,,,,,,,,,,,,,,,,,,,,,,,,,,,,,,,,,,,,,,,,,,,,,,,,,,,,,,,,,,,,,,,,,,,,,,,,,,,,,,,,,,,,,,,,,,,,,,,,,,,,,,,,,,,,,,,,,,,,,,,,,,,,,,,,,,,,,,,,,,,,,,,,,,,,,,,,,,,,,,,,,,,,,,,,,,,,,,,,,,,,,,,,,,,,,,,,,,,,,,,,,,,,,,,,,,,,,,,,,,,,,,,,,,,,,,,,,,,,,,,,,,,,,,,,,,,,,,,,,,,,,,,,,,,,,,,,,,,,,,,,,,,,,,,,,,,,,,,,,,,,,,,,,,,,,,,,,,,,,,,,,,,,,,,,,,,,,,,,,,,,,,,,,,,,,,,,,,,,,,,,,,,,,,,,,,,,,,,,,,,,
p11,male,43,inpatient,no,no,no,no,no,no,no,no,no,no,no,no,no,7.0,yes,yes,yes,no,no,yes,yes,no,yes,no,yes,yes,no,no,no,no,no,no,no,no,,1.0,,,,,,,,,,,,,,,,,,,,,,,,,,,,,,,,,,,,,,,,,,,,,,,,,,,,,,,,,,,,,,,,,,,,,,,,,,,,,,,,,,,,,,,,,,,,,,,,,,,,,,,,,,,,,,,,,,,,,,,,,,,,,,,,,,,,,,,,,,,,,,,,,,,,,,,,,,,,,,,,,,,,,,,,,,,,,,,,,,,,,,,,,,,,,,,,,,,,,,,,,,,,,,,,,,,,,,,,,,,,,,,,,,,,,,,,,,,,,,,,,,,,,,,,,,,,,,,,,,,,,,,,,,,,,,93.0,,,,,,,,,,,,,,,,,,,,,,,,,,,,,,,,,,,,,,,,,,,,,,,,,,,,,,,,,,,,,,,,,,,,,,,,,,,,,,,,,,,,,,,,,,,,,,,,,,,,,,,,,,,,,,,,,,,,,,,,,,,,,,,,,,,,,,,,,,,,,,,,,,,,,,,,,,,,,,,,,,,,,,,,,,,,,,,,,,,,,,,,,,,,,,,,,,,,,,,,,,,,,,,,,,,,,,,,,,,,,,,,,,,,,,,,,,,,,,,,,,,,,,,,,,,,,,,,,,,,,,,,,,,,,,,,,,,,,,,,,,,,,,,,,,,,,,,,,,,,,,,,,,,,,,,,,,,,,,,,,,,,,,,,,,,,,,,,,,,,,,,,,,,,,,,,,,,,,,,,,,,,,,,,,,,,,,,,,,,,,,,,,,,,,,,,,,,,,,,,,,,,,,,,,,,,,,,,,,,,,,,,,,,,,,,,,,,,,,,,,,,,,,,,,,,,,,,,,,,,,,,,,,,,,,,,,,,,,,,,,,,,,
p12,male,78,inpatient,yes,no,yes,no,no,no,no,no,no,no,no,no,no,30.0,no,yes,yes,no,yes,yes,yes,no,no,yes,yes,yes,no,no,yes,yes,yes,yes,no,yes,1.0,4.0,,9.1,3.32,9.2,28.2,84.9,27.7,32.6,153.0,14.4,,,,,,,,,,,,,,,,,,,,,,,,,,,,,,,,,,,,,,,,,,,,,,,,,,,,,,,,,,,,,,,,,,,,,,,,,,,,,,,,,,,,,,,,,,,,,,,,,,,,,,,,,,,,,,,,,,,,,,,,,,,,,,,,,,,,,,,,,,,,,,,,,,,,,,,,,,,,,,,,,,,,,,,,,,,,,,,,,,,,,,,,,,,,,,,,,,,,,,,,,,,,,,,,,,,,,,,,,,,,,,,,,,,,,,,,,,,,,,,,,,,,,,,,,,,,,,,,,,50.0,58.0,,374.0,,,92.0,,90.0,81.0,,689.0,116.0,103.0,,528.0,,,,,,,,,,,,,,,,,,,,,,,,,,,,,,,,,,,,,,,,,,,,,,,,,,,,,,,,,,,,,,,,,,,,,,,,,,,,,,,,,,,,,,,,,,,,,,,,,,,,,,,,,,,,,,,,,,,,,,,,,,,,,,,,,,,,,,,,,,,,,,,,,,,,,,,,,,,,,,,,,,,,,,,,,,,,,,,,,,,,,,,,,,,,,,,,,,,,,,,,,,,,,,,,,,,,,,,,,,,,,,,,,,,,,,,,,,,,,,,,,,,,,,,,,,,,,,,,,,,,,,,,,,,,,,,,,,,,,,,,,,,,,,,,,,,,,,,,,,,,,,,,,,,,,,,,,,,,,,,,,,,,,,,,,,,,,,,,,,,,,,,,,,,,,,,,,,,,,,,,,,,,,,,,,,,,,,,,,,,,,,,,,,,,,,,,,,,,,,,,,,,,,,,,,,,,,,,,,,,,,,,,,,,,,,,,,,,,,,,,,,,,,,,,,,,,,,,,,,,,,,,,,,,,,,,,
p13,male,82,icu,yes,no,yes,no,no,no,no,no,no,no,no,no,no,7.0,no,no,no,yes,no,no,no,no,yes,no,no,yes,no,no,no,no,no,no,no,no,,1.0,6.0,,,,,,,,,,,,,,,,,,,,,,,,,,,,,,,,,,,,,,,,,,,,,,,,,,,,,,,,,,,,,,,,,,,,,,,,,,,,,,,,,,,,,,,,,,,,,,,,,,,,,,,,,,,,,,,,,,,,,,,,,,,,,,,,,,,,,,,,,,,,,,,,,,,,,,,,,,,,,,,,,,,,,,,,,,,,,,,,,,,,,,,,,,,,,,,,,,,,,,,,,,,,,,,,,,,,,,,,,,,,,,,,,,,,,,,,,,,,,,,,,,,,,,,,,,,,,,,,,,,,,,,,,,,,,117.0,,,,,,,,,,,,,,,,,,,,,,,,,,,,,,,,,,,,,,,,,,,,,,7.32,46.4,34.5,23.8,59.7,-2.4,46.0,-1.6,7.42,38.4,33.3,24.7,64.2,1.0,47.9,1.0,7.42,35.1,39.1,22.2,75.1,-1.2,51.7,-2.4,7.37,40.8,59.5,23.3,89.8,-1.8,43.5,-1.9,7.33,52.8,60.7,28.1,89.3,2.0,48.3,2.6,7.35,59.2,22.8,32.2,34.8,5.6,51.1,6.6,,,,,,,,,,,,,,,,,,,,,,,,,,,,,,,,,,,,,,,,,,,,,,,,,,,,,,,,,,,,,,,,,,,,,,,,,,,,,,,,,,,,,,,,,,,,,,,,,,,,,,,,,,,,,,,,,,,,,,,,,,,,,,,,,,,,,,,,,,,,,,,,,,,,,,,,,,,,,,,,,,,,,,,,,,,,,,,,,,,,,,,,,,,,,,,,,,,,,,,,,,,,,,,,,,,,,,,,,,,,,,,,,,,,,,,,,,,,,,,,,,,,,,,,,,,,,,,,,,,,,,,,,,,,,,,,,,,,,,,,,,,,,,,,,,,,,,,,,,,,,,,,,,,,,,,,,,,,,,,,,,,,,,,,,,,,,,,,,,,,,,,,,,,,,,,,,,,,,,,,,,,,,,,,,,,,,,,,,,,,,,,,,,,,,,,,
p14,male,29,inpatient,no,no,no,no,no,no,no,no,no,no,no,no,no,8.0,yes,yes,yes,no,no,no,no,no,no,no,yes,yes,no,no,no,no,no,no,no,no,1.0,3.0,,3.8,4.08,12.2,35.5,87.0,29.9,34.4,198.0,12.6,14.2,10.1,27.0,,,,,,,,,,,,,,,,,,,,,,,,,,,,,,,,,,,,,,,,,,,,,,,,,,,,,,,,,,,,,,,,,,,,,,,,,,,,,,,,,,,,,,,,,,,,,,,,,,,,,,,,,,,,,,,,,,,,,,,,,,,,,,,,,,,,,,,,,,,,,,,,,,,,,,,,,,,,,,,,,,,,,,,,,,,,,,,,,,,,,,,,,,,,,,,,,,,,,,,,,,,,,,,,,,,,,,,,,,,,,,,,,,,,,,,,,,,,,,,,,,,,,,,,,,,,,,,,,66.0,,48.0,17.0,,154.0,,,1067.0,,,,,,,,,,,,,,,,,,,,,,,,,,,,,,,,,,,,,,,,,,,,,,,,,,,,,,,,,,,,,,,,,,,,,,,,,,,,,,,,,,,,,,,,,,,,,,,,,,,,,,,,,,,,,,,,,,,,,,,,,,,,,,,,,,,,,,,,,,,,,,,,,,,,,,,,,,,,,,,,,,,,,,,,,,,,,,,,,,,,,,,,,,,,,,,,,,,,,,,,,,,,,,,,,,,,,,,,,,,,,,,,,,,,,,,,,,,,,,,,,,,,,,,,,,,,,,,,,,,,,,,,,,,,,,,,,,,,,,,,,,,,,,,,,,,,,,,,,,,,,,,,,,,,,,,,,,,,,,,,,,,,,,,,,,,,,,,,,,,,,,,,,,,,,,,,,,,,,,,,,,,,,,,,,,,,,,,,,,,,,,,,,,,,,,,,,,,,,,,,,,,,,,,,,,,,,,,,,,,,,,,,,,,,,,,,,,,,,,,,,,,,,,,,,,,,,,,,,,,,,,,,,,,,,,,,,,,,,
p15,female,50,inpatient,yes,no,no,no,no,no,no,no,yes,no,no,no,no,,no,no,no,no,no,yes,no,no,no,no,no,no,no,no,no,no,no,yes,no,yes,,,,,,,,,,,,,,,,,,,,,,,,,,,,,,,,,,,,,,,,,,,,,,,,,,,,,,,,,,,,,,,,,,,,,,,,,,,,,,,,,,,,,,,,,,,,,,,,,,,,,,,,,,,,,,,,,,,,,,,,,,,,,,,,,,,,,,,,,,,,,,,,,,,,,,,,,,,,,,,,,,,,,,,,,,,,,,,,,,,,,,,,,,,,,,,,,,,,,,,,,,,,,,,,,,,,,,,,,,,,,,,,,,,,,,,,,,,,,,,,,,,,,,,,,,,,,,,,,,,,,,,,,,,,,,,,,,,,,,,,,,,,,,,,,,,,,,,,,,,,,,,,,,,,,,,,,,,,,,,,,,,,,,,,,,,,,,,,,,,,,,,,,,,,,,,,,,,,,,,,,,,,,,,,,,,,,,,,,,,,,,,,,,,,,,,,,,,,,,,,,,,,,,,,,,,,,,,,,,,,,,,,,,,,,,,,,,,,,,,,,,,,,,,,,,,,,,,,,,,,,,,,,,,,,,,,,,,,,,,,,,,,,,,,,,,,,,,,,,,,,,,,,,,,,,,,,,,,,,,,,,,,,,,,,,,,,,,,,,,,,,,,,,,,,,,,,,,,,,,,,,,,,,,,,,,,,,,,,,,,,,,,,,,,,,,,,,,,,,,,,,,,,,,,,,,,,,,,,,,,,,,,,,,,,,,,,,,,,,,,,,,,,,,,,,,,,,,,,,,,,,,,,,,,,,,,,,,,,,,,,,,,,,,,,,,,,,,,,,,,,,,,,,,,,,,,,,,,,,,,,,,,,,,,,,,,,,,,,,,,,,,,,,,,,,,,,,,,,
p16,male,67,inpatient,no,no,no,no,no,no,no,no,no,no,no,no,no,34.0,yes,yes,yes,no,no,no,no,no,no,no,yes,yes,no,no,no,no,yes,yes,yes,no,,1.0,,,,,,,,,,,,,,,,,,,,,,,,,,,,,,,,,,,,,,,,,,,,,,,,,,,,,,,,,,,,,,,,,,,,,,,,,,,,,,,,,,,,,,,,,,,,,,,,,,,,,,,,,,,,,,,,,,,,,,,,,,,,,,,,,,,,,,,,,,,,,,,,,,,,,,,,,,,,,,,,,,,,,,,,,,,,,,,,,,,,,,,,,,,,,,,,,,,,,,,,,,,,,,,,,,,,,,,,,,,,,,,,,,,,,,,,,,,,,,,,,,,,,,,,,,,,,,,,,,,,,,,,,,,,,,38.0,,,,,,,,,,,,,,,,,,,,,,,,,,,,,,,,,,,,,,,,,,,,,,,,,,,,,,,,,,,,,,,,,,,,,,,,,,,,,,,,,,,,,,,,,,,,,,,,,,,,,,,,,,,,,,,,,,,,,,,,,,,,,,,,,,,,,,,,,,,,,,,,,,,,,,,,,,,,,,,,,,,,,,,,,,,,,,,,,,,,,,,,,,,,,,,,,,,,,,,,,,,,,,,,,,,,,,,,,,,,,,,,,,,,,,,,,,,,,,,,,,,,,,,,,,,,,,,,,,,,,,,,,,,,,,,,,,,,,,,,,,,,,,,,,,,,,,,,,,,,,,,,,,,,,,,,,,,,,,,,,,,,,,,,,,,,,,,,,,,,,,,,,,,,,,,,,,,,,,,,,,,,,,,,,,,,,,,,,,,,,,,,,,,,,,,,,,,,,,,,,,,,,,,,,,,,,,,,,,,,,,,,,,,,,,,,,,,,,,,,,,,,,,,,,,,,,,,,,,,,,,,,,,,,,,,,,,,,,,,,,,,,,
p17,female,54,inpatient,yes,no,no,no,no,no,no,no,yes,no,no,no,no,7.0,no,yes,yes,yes,no,yes,yes,no,no,no,no,no,no,no,no,no,no,no,no,no,,1.0,,110.0,65.0,,787.0,,,,,,,,,,,,,,,,,,,,,,,,,,,,,,,,,,,,,,,,,,,,,,,,,,,,,,,,,,,,,,,,,,,,,,,,,,,,,,,,,,,,,,,,,,,,,,,,,,,,,,,,,,,,,,,,,,,,,,,,,,,,,,,,,,,,,,,,,,,,,,,,,,,,,,,,,,,,,,,,,,,,,,,,,,,,,,,,,,,,,,,,,,,,,,,,,,,,,,,,,,,,,,,,,,,,,,,,,,,,,,,,,,,,,,,,,,,,,,,,,,,,,,,,,,,,,,,,,,,,,,,110.0,65.0,,787.0,,,,,,,,,,,,,,,,,,,,,,,,,,,,,,,,,,,,,,,,,,,,,,,,,,,,,,,,,,,,,,,,,,,,,,,,,,,,,,,,,,,,,,,,,,,,,,,,,,,,,,,,,,,,,,,,,,,,,,,,,,,,,,,,,,,,,,,,,,,,,,,,,,,,,,,,,,,,,,,,,,,,,,,,,,,,,,,,,,,,,,,,,,,,,,,,,,,,,,,,,,,,,,,,,,,,,,,,,,,,,,,,,,,,,,,,,,,,,,,,,,,,,,,,,,,,,,,,,,,,,,,,,,,,,,,,,,,,,,,,,,,,,,,,,,,,,,,,,,,,,,,,,,,,,,,,,,,,,,,,,,,,,,,,,,,,,,,,,,,,,,,,,,,,,,,,,,,,,,,,,,,,,,,,,,,,,,,,,,,,,,,,,,,,,,,,,,,,,,,,,,,,,,,,,,,,,,,,,,,,,,,,,,,,,,,,,,,,,,,,,,,,,,,,,,,,,,,,,,,,,,,,,,,,,,,,,,,,,,,,,,,,
p18,female,40,inpatient,no,no,no,no,no,no,no,no,no,no,no,no,no,17.0,yes,yes,no,yes,no,yes,yes,no,no,no,yes,yes,no,no,no,no,yes,yes,no,no,,,,,,,,,,,,,,,,,,,,,,,,,,,,,,,,,,,,,,,,,,,,,,,,,,,,,,,,,,,,,,,,,,,,,,,,,,,,,,,,,,,,,,,,,,,,,,,,,,,,,,,,,,,,,,,,,,,,,,,,,,,,,,,,,,,,,,,,,,,,,,,,,,,,,,,,,,,,,,,,,,,,,,,,,,,,,,,,,,,,,,,,,,,,,,,,,,,,,,,,,,,,,,,,,,,,,,,,,,,,,,,,,,,,,,,,,,,,,,,,,,,,,,,,,,,,,,,,,,,,,,,,,,,,,,,,,,,,,,,,,,,,,,,,,,,,,,,,,,,,,,,,,,,,,,,,,,,,,,,,,,,,,,,,,,,,,,,,,,,,,,,,,,,,,,,,,,,,,,,,,,,,,,,,,,,,,,,,,,,,,,,,,,,,,,,,,,,,,,,,,,,,,,,,,,,,,,,,,,,,,,,,,,,,,,,,,,,,,,,,,,,,,,,,,,,,,,,,,,,,,,,,,,,,,,,,,,,,,,,,,,,,,,,,,,,,,,,,,,,,,,,,,,,,,,,,,,,,,,,,,,,,,,,,,,,,,,,,,,,,,,,,,,,,,,,,,,,,,,,,,,,,,,,,,,,,,,,,,,,,,,,,,,,,,,,,,,,,,,,,,,,,,,,,,,,,,,,,,,,,,,,,,,,,,,,,,,,,,,,,,,,,,,,,,,,,,,,,,,,,,,,,,,,,,,,,,,,,,,,,,,,,,,,,,,,,,,,,,,,,,,,,,,,,,,,,,,,,,,,,,,,,,,,,,,,,,,,,,,,,,,,,,,,,,,,,,,,,,
p19,male,53,inpatient,no,no,no,no,no,no,no,no,no,no,no,no,no,20.0,no,no,no,yes,yes,no,no,no,no,no,no,no,no,no,no,no,yes,yes,no,no,,,,45.0,20.0,119.0,117.0,,,,,,,,,,,,,,,,,,,,,,,,,,,,,,,,,,,,,,,,,,,,,,,,,,,,,,,,,,,,,,,,,,,,,,,,,,,,,,,,,,,,,,,,,,,,,,,,,,,,,,,,,,,,,,,,,,,,,,,,,,,,,,,,,,,,,,,,,,,,,,,,,,,,,,,,,,,,,,,,,,,,,,,,,,,,,,,,,,,,,,,,,,,,,,,,,,,,,,,,,,,,,,,,,,,,,,,,,,,,,,,,,,,,,,,,,,,,,,,,,,,,,,,,,,,,,,,,,,,,,,,,,,,,,,,,,,,,,,,,,,,,,,,,,,,,,,,,,,,,,,,,,,,,,,,,,,,,,,,,,,,,,,,,,,,,,,,,,,,,,,,,,,,,,,,,,,,,,,,,,,,,,,,,,,,,,,,,,,,,,,,,,,,,,,,,,,,,,,,,,,,,,,,,,,,,,,,,,,,,,,,,,,,,,,,,,,,,,,,,,,,,,,,,,,,,,,,,,,,,,,,,,,,,,,,,,,,,,,,,,,,,,,,,,,,,,,,,,,,,,,,,,,,,,,,,,,,,,,,,,,,,,,,,,,,,,,,,,,,,,,,,,,,,,,,,,,,,,,,,,,,,,,,,,,,,,,,,,,,,,,,,,,,,,,,,,,,,,,,,,,,,,,,,,,,,,,,,,,,,,,,,,,,,,,,,,,,,,,,,,,,,,,,,,,,,,,,,,,,,,,,,,,,,,,,,,,,,,,,,,,,,,,,,,,,,,,,,,,,,,,,,,,,,,,,,,,,,,,,,,,,,,,,,,,,,,,,,,,,,,,,,,,,,,,